{"text_format":"1","workbook":"xlsx","n_sheets":8,"sheets":["C-TPAT Audit","Audit - Translations","Sheet1 w Translations","Cargo Flow & Partners","Flow - Translations","Cargo Flow Example","C-TPAT Information","Trailer Inspection Check List"],"not_rendered":{"charts":0,"images":8,"macros":1,"external_links":0,"defined_names":7,"comments":0,"pivot_tables":0},"unopened":[],"bounds":{"document_bytes":16777216,"sheet_cells":100000,"rows_first":2000,"rows_last":500,"rows_between":2000,"halvings":0,"cell_chars":16384,"cell_head_chars":4096},"cells_cut":0,"cells_raw":0,"read":"whole","date_system":"1900"}

{"sheet":"C-TPAT Audit","index":0,"n_rows":108,"n_cols":11,"rows_kept":108,"cut":false,"hidden":false,"merged":[[69,1,69,5],[69,7,69,10],[15,7,15,10],[92,7,92,10],[95,7,95,10],[84,1,84,5],[86,1,86,5],[90,1,90,5],[91,1,91,5],[92,1,92,5],[95,1,95,5],[87,1,87,5],[88,1,88,5],[89,1,89,5],[87,7,87,10],[88,7,88,10],[89,7,89,10],[93,1,93,5],[93,7,93,10],[70,1,70,5],[70,7,70,10],[73,1,73,5],[73,7,73,10],[74,1,74,5],[107,1,107,3],[107,6,107,9],[83,0,83,10],[94,1,94,5],[94,7,94,10],[85,1,85,5],[85,7,85,10],[97,1,97,5],[97,7,97,10],[101,1,101,5],[101,7,101,10],[104,0,104,10],[98,0,98,10],[99,1,99,5],[99,7,99,10],[100,1,100,5],[100,7,100,10],[102,1,102,5],[102,7,102,10],[84,7,84,10],[86,7,86,10],[90,7,90,10],[91,7,91,10],[96,1,96,5],[78,0,78,10],[79,1,79,5],[79,7,79,10],[80,1,80,5],[80,7,80,10],[72,1,72,5],[72,7,72,10],[71,1,71,5],[71,7,71,10],[75,0,75,10],[76,1,76,5],[76,7,76,10],[77,1,77,5],[77,7,77,10],[45,1,45,5],[45,7,45,10],[61,1,61,5],[61,7,61,10],[62,1,62,5],[62,7,62,10],[47,1,47,5],[47,7,47,10],[46,1,46,5],[46,7,46,10],[48,0,48,10],[49,1,49,5],[49,7,49,10],[50,1,50,5],[50,7,50,10],[51,1,51,5],[51,7,51,10],[52,1,52,5],[52,7,52,10],[53,1,53,5],[53,7,53,10],[54,1,54,5],[54,7,54,10],[55,1,55,5],[42,1,42,5],[42,7,42,10],[43,1,43,5],[43,7,43,10],[44,1,44,5],[44,7,44,10],[39,1,39,5],[39,7,39,10],[40,1,40,5],[40,7,40,10],[41,1,41,5],[41,7,41,10],[25,1,25,5],[25,7,25,10],[32,1,32,5],[32,7,32,10],[37,1,37,5],[37,7,37,10],[38,1,38,5],[38,7,38,10],[33,0,33,10],[34,1,34,5],[34,7,34,10],[35,1,35,5],[35,7,35,10],[36,1,36,5],[36,7,36,10],[19,7,19,10],[9,0,11,2],[9,3,11,4],[9,6,11,7],[9,5,11,5],[11,9,11,10],[12,0,12,2],[8,3,8,5],[8,6,8,10],[12,3,12,5],[12,6,12,10],[24,0,24,10],[7,0,7,3],[7,4,7,6],[7,8,7,10],[8,0,8,2],[9,9,9,10],[0,2,2,8],[22,3,22,10],[4,0,4,7],[5,0,5,1],[5,2,5,7],[5,8,5,9],[6,0,6,3],[6,4,6,6],[10,9,10,10],[13,0,13,10],[16,1,16,6],[17,1,17,6],[21,1,21,6],[18,1,18,6],[20,1,20,6],[19,1,19,6],[14,1,14,6],[14,7,14,10],[82,7,82,10],[20,7,20,10],[18,7,18,10],[21,7,21,10],[17,7,17,10],[16,7,16,10],[15,5,15,6],[58,1,58,5],[58,7,58,10],[81,1,81,5],[81,7,81,10],[29,1,29,5],[29,7,29,10],[30,1,30,5],[30,7,30,10],[31,1,31,5],[31,7,31,10],[23,1,23,5],[23,7,23,10],[26,0,26,10],[27,1,27,5],[27,7,27,10],[28,1,28,5],[28,7,28,10],[4,8,4,9],[96,7,96,10],[55,7,55,10],[56,1,56,5],[56,7,56,10],[57,1,57,5],[57,7,57,10],[59,1,59,5],[59,7,59,10],[60,1,60,5],[60,7,60,10],[66,1,66,5],[66,7,66,10],[67,0,67,10],[63,1,63,5],[63,7,63,10],[64,1,64,5],[64,7,64,10],[65,1,65,5],[65,7,65,10],[74,7,74,10],[68,1,68,5],[68,7,68,10],[82,1,82,5]]}
[null,null,"C-TPAT\nSecurity Audit Form"]
[]
[]
["Select Language:",null,null,null,null,null,null,{"$f":"IF(K4=1,\"Please complete in English\",\"英語で記入してください\")","v":"Please complete in English"},null,null,1]
[{"$f":"IF($K$4=1,'Audit - Translations'!A3,'Audit - Translations'!B3)","v":"Supplier General Information"},null,null,null,null,null,null,null,{"$f":"IF(K4=1,'Audit - Translations'!A4,'Audit - Translations'!B4)","v":"Date of Assessment:"}]
[{"$f":"IF(K4=1,'Audit - Translations'!A5,'Audit - Translations'!B5)","v":"Supplier Name:"},null,null,null,null,null,null,null,{"$f":"IF(K4=1,'Audit - Translations'!A6,'Audit - Translations'!B6)","v":"Supplier No.:"}]
[{"$f":"IF(K4=1,'Audit - Translations'!A7,'Audit - Translations'!B7)","v":"Supplier Address:"},null,null,null,{"$f":"IF(K4=1,'Audit - Translations'!A8,'Audit - Translations'!B8)","v":"City:"},null,null,{"$f":"IF(K4=1,'Audit - Translations'!A9,'Audit - Translations'!B9)","v":"State:"},null,{"$f":"IF(K4=1,'Audit - Translations'!A10,'Audit - Translations'!B10)","v":"Zip Code:"}]
[null,null,null,null,null,null,null,{"$f":"IF(K4=1,'Audit - Translations'!A11,'Audit - Translations'!B11)","v":"Country:"}]
[{"$f":"IF(K4=1,'Audit - Translations'!A12,'Audit - Translations'!B12)","v":"Type of Business:"},null,null,"Select from List"]
[{"$f":"IF(K4=1,'Audit - Translations'!A13,'Audit - Translations'!B13)","v":"C-TPAT Contact Information:"},null,null,null,null,{"$f":"IF(K4=1,'Audit - Translations'!A14,'Audit - Translations'!B14)","v":"Position:"},null,null,{"$f":"IF($K$4=1,'Audit - Translations'!A15,'Audit - Translations'!B15)","v":"Office:"}]
[null,null,null,null,null,null,null,null,{"$f":"IF($K$4=1,'Audit - Translations'!A16,'Audit - Translations'!B16)","v":"Mobile:"}]
[null,null,null,null,null,null,null,null,{"$f":"IF($K$4=1,'Audit - Translations'!A17,'Audit - Translations'!B17)","v":"Email:"}]
[{"$f":"IF(K4=1,'Audit - Translations'!A18,'Audit - Translations'!B18)","v":"C-TPAT Certification Status:"},null,null,"Select from List"]
[{"$f":"IF(K4=1,'Audit - Translations'!A19,'Audit - Translations'!B19)","v":"Security Programs"}]
[{"$f":"IF(K4=1,'Audit - Translations'!A20,'Audit - Translations'!B20)","v":"Select"},{"$f":"IF(K4=1,'Audit - Translations'!A21,'Audit - Translations'!B21)","v":"Program"},null,null,null,null,null,{"$f":"IF(K4=1,'Audit - Translations'!A22,'Audit - Translations'!B22)","v":"ID# (as applicable)"}]
[null,{"$f":"IF($K$4=1,'Audit - Translations'!A23,'Audit - Translations'!B23)","v":"AEO (Authorized Economic Operator)"},null,null,null,"Select Country/Region"]
[null,{"$f":"IF($K$4=1,'Audit - Translations'!A24,'Audit - Translations'!B24)","v":"ACE (Automated Commercial Environment Participant)"}]
[null,{"$f":"IF($K$4=1,'Audit - Translations'!A25,'Audit - Translations'!B25)","v":"AES (Automated Export System Participant)"}]
[null,{"$f":"IF($K$4=1,'Audit - Translations'!A26,'Audit - Translations'!B26)","v":"BASC (Business Anti-Smuggling Coalition)"}]
[null,{"$f":"IF($K$4=1,'Audit - Translations'!A27,'Audit - Translations'!B27)","v":"CIP (Carrier Initiative Program)"}]
[null,{"$f":"IF($K$4=1,'Audit - Translations'!A28,'Audit - Translations'!B28)","v":"SCIP (Super Carrier Initiative Program)"}]
[null,{"$f":"IF($K$4=1,'Audit - Translations'!A29,'Audit - Translations'!B29)","v":"FAST (Free and Secure Trade)"}]
[null,{"$f":"IF(K4=1,'Audit - Translations'!A30,'Audit - Translations'!B30)","v":"Other, Specify:"}]
[{"$f":"IF(K4=1,'Audit - Translations'!A31,'Audit - Translations'!B31)","v":"Item No."},{"$f":"IF(K4=1,'Audit - Translations'!A32,'Audit - Translations'!B32)","v":"Questions"},null,null,null,null,"Yes\nNo",{"$f":"IF(K4=1,'Audit - Translations'!A34,'Audit - Translations'!B34)","v":"Comments / Supporting Data"}]
[{"$f":"IF(K4=1,'Audit - Translations'!A35,'Audit - Translations'!B35)","v":"Social Compliance"}]
[1,{"$f":"IF(K4=1,'Audit - Translations'!A36,'Audit - Translations'!B36)","v":"Does your company have a documented social compliance program in place that, at a minimum, addresses how product and its constituents are not mined, produced, or manufactured, wholly or in part, with prohibited forms of labor (i.e., forced, imprisoned, indentured, or indentured child labor)?"}]
[{"$f":"IF(K4=1,'Audit - Translations'!A37,'Audit - Translations'!B37)","v":"Procedural Security"}]
[1,{"$f":"IF($K$4=1,'Audit - Translations'!A38,'Audit - Translations'!B38)","v":"Are procedures in place to ensure that all information used in the clearing of merchandise/cargo, is legible, complete, accurate, and protected against the exchange, loss or introduction of erroneous information?"}]
[2,{"$f":"IF($K$4=1,'Audit - Translations'!A39,'Audit - Translations'!B39)","v":"Are procedures in place to ensure that information received is accurate and timely?"}]
[3,{"$f":"IF($K$4=1,'Audit - Translations'!A40,'Audit - Translations'!B40)","v":"Are procedures in place to ensure that cargo is accurately described, and the weights, labels, marks and piece count indicated and verified?"}]
[4,{"$f":"IF($K$4=1,'Audit - Translations'!A41,'Audit - Translations'!B41)","v":"Is outbound cargo verified against purchase or delivery orders?"}]
[5,{"$f":"IF($K$4=1,'Audit - Translations'!A42,'Audit - Translations'!B42)","v":"Are drivers positively identified before cargo is received or released?"}]
[6,{"$f":"IF($K$4=1,'Audit - Translations'!A43,'Audit - Translations'!B43)","v":"Are procedures in place to ensure that cargo discrepancies are resolved and/or investigated appropriately?"}]
[{"$f":"IF($K$4=1,'Audit - Translations'!A44,'Audit - Translations'!B44)","v":"Physical Security"}]
[1,{"$f":"IF($K$4=1,'Audit - Translations'!A45,'Audit - Translations'!B45)","v":"Are there fences enclosing your cargo handling and storage facilities?"}]
[2,{"$f":"IF($K$4=1,'Audit - Translations'!A46,'Audit - Translations'!B46)","v":"Do you have separate fenced areas that separate your domestic, international, high-value, and dangerous/hazardous cargo?"}]
[3,{"$f":"IF($K$4=1,'Audit - Translations'!A47,'Audit - Translations'!B47)","v":"If you have fences, are they regularly inspected for integrity and damage?"}]
[4,{"$f":"IF($K$4=1,'Audit - Translations'!A48,'Audit - Translations'!B48)","v":"Are there gates and gate houses that control the entry of vehicles and personnel to your premises?"}]
[5,{"$f":"IF($K$4=1,'Audit - Translations'!A49,'Audit - Translations'!B49)","v":"Are employee and visitor parking areas separated from the cargo handling and storage areas?"}]
[6,{"$f":"IF($K$4=1,'Audit - Translations'!A50,'Audit - Translations'!B50)","v":"Are your buildings constructed of materials that can resist unlawful entry, and are they maintained through periodic inspection and repair?"}]
{"$rows_left_out":69}
{"sheet":"Audit - Translations","index":1,"n_rows":113,"n_cols":2,"rows_kept":113,"cut":false,"hidden":true,"merged":[]}
["English","Japanese－日本語"]
["C-TPAT\nSecurity Audit Form","C-TPAT（テロ防止のための税関産業界提携プログラム）\nセキュリティ 監査フォーム"]
["Supplier General Information","サプライヤーの一般情報"]
["Date of Assessment:","評価日："]
["Supplier Name:","サプライヤー名："]
["Supplier No.:","サプライヤー番号："]
["Supplier Address:","サプライヤー住所："]
["City:","市："]
["State:","州："]
["Zip Code:","郵便番号："]
["Country:","国："]
["Type of Business:","業種："]
["C-TPAT Contact Information:","C-TPAT 連絡先情報："]
["Position:","ポジション："]
["Office:","オフィス："]
["Mobile:","携帯："]
["Email:","Email："]
["C-TPAT Certification Status:","C-TPAT 認定ステータス："]
["Security Programs","セキュリティプログラム"]
["Select","選択"]
["Program","プログラム"]
["ID# (as applicable)","ID 番号（該当する場合）"]
["AEO (Authorized Economic Operator)","AEO（認定事業者）"]
["ACE (Automated Commercial Environment Participant)","ACE（輸出入自動通関システム）"]
["AES (Automated Export System Participant)","AES（自動輸出システム参加者）"]
["BASC (Business Anti-Smuggling Coalition)","BASC（ビジネス反密輸連合）"]
["CIP (Carrier Initiative Program)","CIP（キャリアイニシアチブプログラム）"]
["SCIP (Super Carrier Initiative Program)","SCIP（スーパー キャリアイニシアチブプログラム）"]
["FAST (Free and Secure Trade)","FAST（自由で安全な貿易）"]
["Other, Specify:","その他、具体的に："]
["Item No.","項目番号"]
["Questions","質問"]
["Yes\nNo","はい\nいいえ"]
["Comments / Supporting Data","コメント／補足データ"]
["Social Compliance","社会的コンプライアンス"]
["Does your company have a documented social compliance program in place that, at a minimum, addresses how product and its constituents are not mined, produced, or manufactured, wholly or in part, with prohibited forms of labor (i.e., forced, imprisoned, indentured, or indentured child labor)?","貴社では最低限、禁止された労働形態（つまり強制労働、投獄、年季奉公または年季奉公の児童労働）で、製品とその構成要素が全体的にまたは部分的に採掘、生産、製造されない方法に対処する、ドキュメント化された社会的コンプライアンスプログラムを実施していますか？"]
["Procedural Security","手続き上のセキュリティ"]
["Are procedures in place to ensure that all information used in the clearing of merchandise/cargo, is legible, complete, accurate, and protected against the exchange, loss or introduction of erroneous information?","商品／貨物の清算に使用される全ての情報は読み易く、完全で正確であり、誤った情報の交換、損失、または導入から保護を確実にするための手順は整っていますか？"]
["Are procedures in place to ensure that information received is accurate and timely?","受け取った情報が正確でタイムリーであることを保証するための手順は整っていますか？"]
["Are procedures in place to ensure that cargo is accurately described, and the weights, labels, marks and piece count indicated and verified?","貨物が正確に記述され、重量、ラベル、マーク、個数が表示および検証されることを保証するための手順は整っていますか？"]
{"$rows_left_out":74}
{"sheet":"Sheet1 w Translations","index":2,"n_rows":14,"n_cols":14,"rows_kept":14,"cut":false,"hidden":true,"merged":[]}
["Selection","ENGLISH","JAPANESE－日本語　",null,"Selection","ENGLISH","JAPANESE－日本語",null,null,null,null,"Selection","ENGLISH","JAPANESE－日本語"]
[{"$f":"INDEX(B2:C2,'C-TPAT Audit'!$K$4)","v":"Select from List"},"Select from List","リストから選択",null,{"$f":"INDEX(F2:G2,'C-TPAT Audit'!$K$4)","v":"Select from List"},"Select from List","リストから選択",null,"ENGLISH","JAPANESE－日本語",null,{"$f":"INDEX(M2:N2,'C-TPAT Audit'!$K$4)","v":"Select Country/Region"},"Select Country/Region","国／地域を選択"]
[{"$f":"INDEX(B3:C3,'C-TPAT Audit'!$K$4)","v":"Manufacturer"},"Manufacturer","メーカー",null,{"$f":"INDEX(F3:G3,'C-TPAT Audit'!$K$4)","v":"Certified"},"Certified","認証済",null,"X",null,null,{"$f":"INDEX(M3:N3,'C-TPAT Audit'!$K$4)","v":"Canada"},"Canada","カナダ"]
[{"$f":"INDEX(B4:C4,'C-TPAT Audit'!$K$4)","v":"Warehouse"},"Warehouse","倉庫",null,{"$f":"INDEX(F4:G4,'C-TPAT Audit'!$K$4)","v":"Application for C-TPAT"},"Application for C-TPAT","C-TPAT の申請",null,"N/A",null,null,{"$f":"INDEX(M4:N4,'C-TPAT Audit'!$K$4)","v":"Dominican Republic"},"Dominican Republic","ドミニカ共和国"]
[{"$f":"INDEX(B5:C5,'C-TPAT Audit'!$K$4)","v":"Distributor/Supplier"},"Distributor/Supplier","販売業者／仕入先",null,{"$f":"INDEX(F5:G5,'C-TPAT Audit'!$K$4)","v":"No plans for C-TPAT"},"No plans for C-TPAT","C-TPAT の予定なし",null,null,null,null,{"$f":"INDEX(M5:N5,'C-TPAT Audit'!$K$4)","v":"European Union"},"European Union","欧州連合"]
[{"$f":"INDEX(B6:C6,'C-TPAT Audit'!$K$4)","v":"Forwarder"},"Forwarder","運送業者",null,{"$f":"INDEX(F6:G6,'C-TPAT Audit'!$K$4)","v":"Other (Specify):"},"Other (Specify):","その他（具体的に）：",null,null,null,null,{"$f":"INDEX(M6:N6,'C-TPAT Audit'!$K$4)","v":"Israel"},"Israel","イスラエル"]
[{"$f":"INDEX(B7:C7,'C-TPAT Audit'!$K$4)","v":"Air Carrier"},"Air Carrier","航空運送業者",null,null,null,null,null,null,null,null,{"$f":"INDEX(M7:N7,'C-TPAT Audit'!$K$4)","v":"Japan"},"Japan","日本"]
[{"$f":"INDEX(B8:C8,'C-TPAT Audit'!$K$4)","v":"Consolidator"},"Consolidator","コンソリデーター",null,null,null,null,null,null,null,null,{"$f":"INDEX(M8:N8,'C-TPAT Audit'!$K$4)","v":"Jordan"},"Jordan","ヨルダン"]
[{"$f":"INDEX(B9:C9,'C-TPAT Audit'!$K$4)","v":"Trucking"},"Trucking","トラック輸送",null,null,null,null,null,null,null,null,{"$f":"INDEX(M9:N9,'C-TPAT Audit'!$K$4)","v":"Korea"},"Korea","韓国"]
[{"$f":"INDEX(B10:C10,'C-TPAT Audit'!$K$4)","v":"Rail"},"Rail","鉄道",null,null,null,null,null,null,null,null,{"$f":"INDEX(M10:N10,'C-TPAT Audit'!$K$4)","v":"Mexico"},"Mexico","メキシコ"]
[{"$f":"INDEX(B11:C11,'C-TPAT Audit'!$K$4)","v":"Broker"},"Broker","ブローカー",null,null,null,null,null,null,null,null,{"$f":"INDEX(M11:N11,'C-TPAT Audit'!$K$4)","v":"New Zealand"},"New Zealand","ニュージーランド"]
[{"$f":"INDEX(B12:C12,'C-TPAT Audit'!$K$4)","v":"Sea Carrier"},"Sea Carrier","海上輸送船",null,null,null,null,null,null,null,null,{"$f":"INDEX(M12:N12,'C-TPAT Audit'!$K$4)","v":"Peru"},"Peru","ペルー"]
[{"$f":"INDEX(B13:C13,'C-TPAT Audit'!$K$4)","v":"Other (Specify):"},"Other (Specify):","その他（具体的に）：",null,null,null,null,null,null,null,null,{"$f":"INDEX(M13:N13,'C-TPAT Audit'!$K$4)","v":"Singapore"},"Singapore","シンガポール"]
[null,null,null,null,null,null,null,null,null,null,null,{"$f":"INDEX(M14:N14,'C-TPAT Audit'!$K$4)","v":"Taiwan"},"Taiwan","台湾"]

{"sheet":"Cargo Flow & Partners","index":3,"n_rows":9,"n_cols":7,"rows_kept":9,"cut":false,"hidden":false,"merged":[[4,0,4,6]]}
[{"$f":"IF('C-TPAT Audit'!$K$4=1,'Flow - Translations'!A2,'Flow - Translations'!B2)","v":"Cargo Flow and Partner Map"}]
[]
[{"$f":"IF('C-TPAT Audit'!K4=1,'Flow - Translations'!A3,'Flow - Translations'!B3)","v":"Map Cargo Flow, Identify Partners, and Processes"}]
[]
[{"$f":"IF('C-TPAT Audit'!K4=1,'Flow - Translations'!A4,'Flow - Translations'!B4)","v":"Notes: Ensure partners map out all variations of a supply chain - For example, FCL vs. LCL: From one factory to various ports of export; From one factory using different modes of transportation (Air vs. Sea); Any other potential variations that would alter the movement of cargo or the individuals involved in the process. Always remember - \"Freight at Rest is Freight at Risk\"."}]
[]
[{"$f":"IF('C-TPAT Audit'!K4=1,'Flow - Translations'!A5,'Flow - Translations'!B5)","v":"Sub-contracting increases risk within a supply chain, particularly where security requirements have not been conveyed or verified."}]
[]
[{"$f":"IF('C-TPAT Audit'!$K$4=1,'Flow - Translations'!A6,'Flow - Translations'!B6)","v":"Partner"},{"$f":"IF('C-TPAT Audit'!$K$4=1,'Flow - Translations'!A7,'Flow - Translations'!B7)","v":"Process"},{"$f":"IF('C-TPAT Audit'!$K$4=1,'Flow - Translations'!A8,'Flow - Translations'!B8)","v":"Cargo Movement  - if applicable"},{"$f":"IF('C-TPAT Audit'!$K$4=1,'Flow - Translations'!A9,'Flow - Translations'!B9)","v":"Known Details About Provider"},{"$f":"IF('C-TPAT Audit'!$K$4=1,'Flow - Translations'!A10,'Flow - Translations'!B10)","v":"Days Cargo is \"At Rest\" at this stage"},{"$f":"IF('C-TPAT Audit'!$K$4=1,'Flow - Translations'!A11,'Flow - Translations'!B11)","v":"Transport mode"},{"$f":"IF('C-TPAT Audit'!$K$4=1,'Flow - Translations'!A12,'Flow - Translations'!B12)","v":"If entity physically handles cargo, who selects them as a provider?"}]

{"sheet":"Flow - Translations","index":4,"n_rows":12,"n_cols":2,"rows_kept":12,"cut":false,"hidden":true,"merged":[]}
["English","Japanese－日本語"]
["Cargo Flow and Partner Map","貨物フローとパートナーマップ"]
["Map Cargo Flow, Identify Partners, and Processes","貨物フローをマッピングし、パートナーとプロセスを特定します。"]
["Notes: Ensure partners map out all variations of a supply chain - For example, FCL vs. LCL: From one factory to various ports of export; From one factory using different modes of transportation (Air vs. Sea); Any other potential variations that would alter the movement of cargo or the individuals involved in the process. Always remember - \"Freight at Rest is Freight at Risk\".","注：パートナーがサプライチェーンの全てのバリエーションを精密に計画することを確認します。－例えば、FCL対LCL：１つの工場から様々な輸出港まで。１つの工場から異なる輸送手段（航空対海上）を使う。貨物の動きやプロセスに関わる個々を変える可能性があるその他の潜在的なバリエーション。―「停止時の貨物は、リスクがある貨物」ということを常に覚えておいてください。"]
["Sub-contracting increases risk within a supply chain, particularly where security requirements have not been conveyed or verified.","下請けは、特にセキュリティ要件が伝達または検証されていない場合、サプライチェーン内のリスクを増加させます。"]
["Partner","パートナー"]
["Process","プロセス"]
["Cargo Movement  - if applicable","貨物の移動－該当する場合"]
["Known Details About Provider","プロバイダーに関する既知の詳細"]
["Days Cargo is \"At Rest\" at this stage","貨物はこの段階で「休止中」です。"]
["Transport mode","輸送モード"]
["If entity physically handles cargo, who selects them as a provider?","実体者が貨物を物理的に処理する場合、プロバイダーとしてそれらを選択するのは誰ですか？"]

{"sheet":"Cargo Flow Example","index":5,"n_rows":1,"n_cols":1,"rows_kept":1,"cut":false,"hidden":false,"merged":[]}
["Cargo Flow Example - For Reference Only"]

{"sheet":"C-TPAT Information","index":6,"n_rows":36,"n_cols":5,"rows_kept":36,"cut":false,"hidden":false,"merged":[[1,0,1,11],[9,2,9,13],[13,2,13,8],[17,2,17,8],[21,0,27,13]]}
["Visit www.cbp.gov for latest information and tools"]
["https://www.cbp.gov/border-security/ports-entry/cargo-security/c-tpat-customs-trade-partnership-against-terrorism"]
[]
[]
[null,null,null,null,"C-TPAT Presentation"]
[]
[]
[]
[null,null,"C-TPAT Five Step Risk Assessment"]
[null,null,"https://www.cbp.gov/sites/default/files/documents/C-TPAT%27s%20Five%20Step%20Risk%20Assessment%20Process.pdf"]
[]
[]
[null,null,"7-Point Container Inspection"]
[null,null,"https://www.cbp.gov/sites/default/files/documents/7_pcic.pdf"]
[]
[]
[null,null,"17-Point Truck & Trailer Inspection"]
[null,null,"https://www.cbp.gov/sites/default/files/documents/17_pic.pdf"]
[]
[]
["Social Compliance Program"]
["Section 307 of the Tariff Act of 1930 (19 U.S.C. § 1307) prohibits the importation of merchandise mined, produced or manufactured, wholly or in part, in any foreign country by forced or indentured child labor – including forced child labor. Forced labor is defined by the International Labor Organization’s Convention No. 29 as all work or service exacted from any person under the menace of any penalty and for which the said person has not offered himself voluntarily. A social compliance program is a set of policies and practices through which a company seeks to ensure maximum adherence to the elements of its code of conduct that cover social and labor issues. Social compliance refers to how a business addresses its responsibilities in protecting the environment, as well as the health, safety, and rights of its employees, the communities in which they operate, and the lives and communities of workers along their supply chains."]
[]
[]
[]
[]
[]
[]
[]
["Cypersecurity Framework"]
["https://www.nist.gov/cyberframework"]
[]
[]
[]
[]
["Provided as reference only."]

{"sheet":"Trailer Inspection Check List","index":7,"n_rows":58,"n_cols":11,"rows_kept":58,"cut":false,"hidden":false,"merged":[[16,1,16,2],[0,0,0,10],[7,9,8,10],[9,9,10,10],[29,5,29,10],[16,5,16,10],[25,5,25,10],[28,5,28,10],[21,5,21,10],[22,5,22,10],[23,5,23,10],[24,5,24,10],[31,5,31,10],[17,5,17,10],[18,5,18,10],[19,5,19,10],[20,5,20,10],[26,5,26,10],[27,5,27,10],[30,5,30,10]]}
["Trailer/Flatbed Inspection Check List - For Reference Only"]
[null,"Date:",null,null,null,"Arrival / Departure Time:"]
[null,"Carrier Name:"]
[null,"Driver Name:"]
[null,"Tractor #:",null,null,null,"Truck-truck License Plate No.# :"]
[null,"Trailer ID Number #:",null,null,null,"Trailer License Plate No. # :"]
[]
[null,null,null,null,null,null,null,null,null,"Internal Control Number"]
[]
[]
[]
[]
[null,null,null,null,null,null,null,"Seal Affixed By:    "]
[]
[null,null,null,null,null,null,null,"VVTT Conducted:",null,"Yes","No"]
[]
["#","Points of Inspection",null,null,"OK","Observations"]
[1,"Front / Rear Bumper"]
[2,"Motor / Engine"]
[3,"Cab Floor"]
[4,"Fuel Tanks"]
[5,"Tires"]
[6,"Drive Shaft"]
[7,"Cabin"]
[8,"Air Cylinders "]
[9,"Mufflers"]
[10,"Refrigerator"]
[11,"Fifth Wheel"]
[12,"Trailer Frame"]
[13,"Rear / Trailer Doors"]
[14,"Walls / Ceiling"]
[15,"Axles"]
[16,"Roof"]
[null,null,null,null,null,null,"Trailer (Dry Van) Measurements",null,null,"53'","48'"]
[null,null,null,null,null,null,"Internal Measurement",null,"Height"]
[null,null,null,null,null,null,null,null,"Width"]
[null,null,null,null,null,null,null,null,"Length"]
[null,null,null,null,null,null,"External Measurement",null,"Height"]
[null,null,null,null,null,null,null,null,"Width"]
[null,null,null,null,null,null,null,null,"Length"]
{"$rows_left_out":18}